{"text_format":"1","workbook":"xlsx","n_sheets":7,"sheets":["ActivityForm","ActualData","IntendedData","ActualDataMaster","IntendedDataMaster","Report","Instructions"],"not_rendered":{"charts":0,"images":0,"macros":1,"external_links":0,"defined_names":0,"comments":0,"pivot_tables":0},"unopened":[],"bounds":{"document_bytes":16777216,"sheet_cells":100000,"rows_first":2000,"rows_last":500,"rows_between":2000,"halvings":0,"cell_chars":16384,"cell_head_chars":4096},"cells_cut":0,"cells_raw":0,"read":"whole","date_system":"1900"}

{"sheet":"ActivityForm","index":0,"n_rows":34,"n_cols":6,"rows_kept":34,"cut":false,"hidden":false,"merged":[[29,1,32,5],[34,1,37,5],[6,4,8,5],[0,1,0,4],[1,2,1,4],[14,1,14,2],[5,1,5,2],[6,1,8,2]]}
[null,"SMU Vessel Monitoring Activity Log"]
[null,"Vessel Name:","Nancy Foster"]
[]
[null,"Today - Date:","2010-07-14",null,"Tomorrow - Date:","2010-07-15"]
[]
[null,"General Location",null,null,"Intended Location"]
[null,"Eastern border of  Eddy Franklin",null,null,"Eddy Franklin "]
[]
[]
[]
[]
[null,"Frequency:",null,null,"Frequency:"]
[]
[]
[null,"Monitoring Techniques Used Today",null,null,"Monitoring Techniques for Tomorrow"]
[]
[]
[]
[]
[]
[]
[]
[]
[]
[]
[]
[]
[]
[null,"Today's Significant Findings:"]
[null,"No oil found."]
[]
[]
[]
[null,"Notes/Questions:"]

{"sheet":"ActualData","index":1,"n_rows":2,"n_cols":21,"rows_kept":2,"cut":false,"hidden":true,"merged":[]}
["VesselName","ActivityDate","ActivityLocation","AcousticsUsed","Frequency","ExclusionZoneEntry","CDT","Fluorometry","LISST","Sampling-TPH","Sampling-VOA","Sampling-Other","MassSpec","Acoustics","MOCNESS","PAH-Detection","Biota","Rototox","Other","Findings","Notes"]
[{"$f":"ActivityForm!C2","v":"Nancy Foster"},{"$f":"ActivityForm!C4","v":"2010-07-14"},{"$f":"ActivityForm!B7","v":"Eastern border of  Eddy Franklin"},false,{"$f":"ActivityForm!C12","v":0},false,true,true,false,false,false,false,false,false,true,false,false,false,true,{"$f":"ActivityForm!B30","v":"No oil found."},{"$f":"ActivityForm!$B$35","v":0}]

{"sheet":"IntendedData","index":2,"n_rows":2,"n_cols":19,"rows_kept":2,"cut":false,"hidden":true,"merged":[]}
["VesselName","IntendedDate","IntendedLocation","AcousticsUsed","Frequency","ExclusionZoneEntry","CDT","Fluorometry","LISST","Sampling-TPH","Sampling-VOA","Sampling-Other","MassSpec","Acoustics","MOCNESS","PAH-Detection","Biota","Rototox","Other"]
[{"$f":"ActivityForm!C2","v":"Nancy Foster"},{"$f":"ActivityForm!F4","v":"2010-07-15"},{"$f":"ActivityForm!E7","v":"Eddy Franklin "},false,{"$f":"ActivityForm!F12","v":0},false,true,true,false,null,null,false,false,false,true,false,false,false,true]

{"sheet":"ActualDataMaster","index":3,"n_rows":5,"n_cols":21,"rows_kept":5,"cut":false,"hidden":true,"merged":[]}
["VesselName","ActivityDate","ActivityLocation","AcousticsUsed","Frequency","ExclusionZoneEntry","CDT","Fluorometry","LISST","Sampling-TPH","Sampling-VOA","Sampling-Other","MassSpec","Acoustics","MOCNESS","PAH-Detection","Biota","Rototox","Other","Findings","Notes"]
["Ryan Chouest","2010-06-30","Somewhere off the coast of LA",false,0,false,true,true,false,false,false,false,true,false,false,false,true,false,false,"We struck oil!","Can you add a place to put down numbers of CTDs or other samples…"]
["R/V Mike Levine","2010-06-30","15 nm NW of well head",true,"38 kHz",false,true,false,true,false,true,false,true,false,true,false,true,false,true,"Oil oil everywhere, nary a drop to drink","This looks good"]
[" Ship number 2","2010-06-30","This is a big box for the location222",true,222,true,true,true,false,true,true,false,true,true,false,true,true,false,true,"Lots of oil found south of the well ","Sample pickup was late"]
[" Ship number 1","2010-06-30","This is a big box for the location",true,222,true,true,true,false,true,true,false,true,true,false,true,true,false,true,"Lots of oil found south of the well ","Sample pickup was late"]

{"sheet":"IntendedDataMaster","index":4,"n_rows":1,"n_cols":19,"rows_kept":1,"cut":false,"hidden":true,"merged":[]}
["VesselName","IntendedDate","IntendedLocation","AcousticsUsed","Frequency","ExclusionZoneEntry","CDT","Fluorometry","LISST","Sampling-TPH","Sampling-VOA","Sampling-Other","MassSpec","Acoustics","MOCNESS","PAH-Detection","Biota","Rototox","Other"]

{"sheet":"Report","index":5,"n_rows":20,"n_cols":21,"rows_kept":20,"cut":false,"hidden":true,"merged":[[0,0,0,2]]}
["SMU Vessel Monitoring Activity Report"]
[]
["ACTUAL ACTIVITIES"]
["VesselName","ActivityDate","ActivityLocation","AcousticsUsed","Frequency","ExclusionZoneEntry","CDT","Fluorometry","LISST","Sampling-TPH","Sampling-VOA","Sampling-Other","MassSpec","Acoustics","MOCNESS","PAH-Detection","Biota","Rototox","Other","Findings","Notes"]
["Ryan Chouest","2010-06-30","Somewhere off the coast of LA",null,0,null,"X","X",null,null,null,null,"X",null,null,null,"X",null,null,"We struck oil!","Can you add a place to put down numbers of CTDs or other samples…"]
["R/V Mike Levine","2010-06-30","15 nm NW of well head","X","38 kHz",null,"X",null,"X",null,"X",null,"X",null,"X",null,"X",null,"X","Oil oil everywhere, nary a drop to drink","This looks good"]
[" Ship number 2","2010-06-30","This is a test for ship 2 location","X",222,"X","X","X",null,"X","X",null,"X","X",null,"X","X",null,"X","Lots of oil found south of the well ","Sample pickup was late"]
[" Ship number 1","2010-06-30","This is a testfor the location","X",111,"X","X","X",null,"X","X",null,"X","X",null,"X","X",null,"X","Lots of oil found south of the well ","Sample pickup was late"]
[]
[]
[]
[]
[]
[]
[]
[]
[]
[null,{"$f":"IF(ActualData!B12>0,ActualData!B12,\"\")","v":""}]
["PROPOSED ACTIVITIES"]
["VesselName","IntendedDate","IntendedLocation","AcousticsUsed","Frequency","ExclusionZoneEntry","CDT","Fluorometry","LISST","Sampling-TPH","Sampling-VOA","Sampling-Other","MassSpec","Acoustics","MOCNESS","PAH-Detection","Biota","Rototox","Other"]

{"sheet":"Instructions","index":6,"n_rows":11,"n_cols":3,"rows_kept":11,"cut":false,"hidden":false,"merged":[]}
[]
[null,"Please follow these instructions for entering the Vessel Activities"]
[]
[null,"1.","Enter Vessel Name"]
[null,"2.","Enter General location (ie distance from well head or coastal feature)"]
[null,"3.","Checkoff Acoustic Equipment if used and add frequency"]
[null,"4.","Checkoff the Monitoring Techniques used"]
[null,"5.","Enter a brief list of findings"]
[null,"6.","Enter notes or questions"]
[]
[null,"Save the file and email along with nightly data deliverables"]